Target
N-formyl peptide receptor 2
Ligand
BDBM454192
Substrate
Meas. Tech.
cAMP Assay
EC50
0.140±n/a nM
Citation
 Wurtz, NRShirude, PS Piperidinone formyl peptide 2 receptor and formyl peptide 1 receptor agonists US Patent  US10717708 Publication Date 7/21/2020 
Target
Name:
N-formyl peptide receptor 2
Synonyms:
ALXR, FPRL1, FPR2 FPR2 FPRH1 Formyl Peptide Receptor-Like 1 LXA4 receptor Lipoxin A4 receptor RFP | hFPRL
Type:
G Protein-Coupled Receptor (GPCR)
Mol. Mass.:
38968.35
Organism:
Homo sapiens (Human)
Description:
P25090
Residue:
351
  
Inhibitor
Name:
BDBM454192
Synonyms:
US10717708, Example 86 US11530183, Example 86
Type:
Small organic molecule
Emp. Form.:
C25H25ClN4O4S
Mol. Mass.:
513.008
SMILES:
CS(=O)(=O)Nc1ccccc1-c1ccc(cc1)N1CCC[C@@H](NC(=O)Nc2ccc(Cl)cc2)C1=O
: