Target
Membrane primary amine oxidase
Ligand
BDBM454349
Substrate
Meas. Tech.
Inhibit Human Recombinant Assay
IC50
>3000±n/a nM
Citation
 Findlay, ADTurner, CIDeodhar, MFoot, JSJarolimek, WZhou, WRobertson, AD Indole and azaindole haloallylamine derivative inhibitors of lysyl oxidases and uses thereof US Patent  US10717734 Publication Date 7/21/2020 
Target
Name:
Membrane primary amine oxidase
Synonyms:
AOC3 Amine oxidase, copper containing Semicarbazide-sensitive amine oxidase/ Vascular adhesion protein 1 (SSAO/VAP-1) Vascular adhesion protein 1 (VAP-1)
Type:
Protein
Mol. Mass.:
84620.86
Organism:
Homo sapiens (Human)
Description:
Q16853
Residue:
763
  
Inhibitor
Name:
BDBM454349
Synonyms:
US10717734, Compound 25
Type:
Small organic molecule
Emp. Form.:
C22H26FN3O3S
Mol. Mass.:
431.524
SMILES:
CC(C)(O)c1c(Cc2ccc(cc2)S(C)(=O)=O)c2ncccc2n1C\C(F)=C\CN
: