Target
Amine oxidase [flavin-containing] B
Ligand
BDBM454352
Substrate
Meas. Tech.
Inhibit Human Recombinant Assay
IC50
>3000±n/a nM
Citation
 Findlay, ADTurner, CIDeodhar, MFoot, JSJarolimek, WZhou, WRobertson, AD Indole and azaindole haloallylamine derivative inhibitors of lysyl oxidases and uses thereof US Patent  US10717734 Publication Date 7/21/2020 
Target
Name:
Amine oxidase [flavin-containing] B
Synonyms:
AOFB_HUMAN MAOB Monoamine oxidase type B (MAO B) Monoamine oxidase type B (MAOB)
Type:
Protein
Mol. Mass.:
58768.76
Organism:
Homo sapiens (Human)
Description:
P27338
Residue:
520
  
Inhibitor
Name:
BDBM454352
Synonyms:
US10717734, Compound 28
Type:
Small organic molecule
Emp. Form.:
C24H31FN4O3S
Mol. Mass.:
474.591
SMILES:
CN(C)S(=O)(=O)c1ccc(Cc2c(C)n(C\C(F)=C\CN)c3ccc(nc23)C(C)(C)O)cc1
: