Target
Tyrosine-protein kinase JAK1
Ligand
BDBM246864
Substrate
Meas. Tech.
In Vitro JAK Kinase Assay
IC50
<10±n/a nM
Citation
 Li, YMetcalf, BWLi, H Crystalline forms of a PI3K inhibitor US Patent  US10125150 Publication Date 11/13/2018 
Target
Name:
Tyrosine-protein kinase JAK1
Synonyms:
JAK-1 JAK1A JAK1_HUMAN Janus kinase 1 (JAK1) | Janus kinase 1 JAK1
Type:
Protein
Mol. Mass.:
133293.73
Organism:
Homo sapiens (Human)
Description:
P23458
Residue:
1154
  
Inhibitor
Name:
BDBM246864
Synonyms:
3-(1- [1,3]oxazolo[5,4- b]pyridin-2- ylpyrrolidin-3-yl)-3- [4-(7H-pyrrolo[2,3- d]pyrimidin-4-yl)- 1H-pyrazol-1- yl]propanenitrile US10065963, Compound 4 US10336759, # 4 US10519163, Example 4 US11084822, Example 4 US11136326, Example 4 US11324749, Comp. No. 7 US11596632, Comp. No. 7 US9732097, Example 4
Type:
Small organic molecule
Emp. Form.:
C22H19N9O
Mol. Mass.:
425.446
SMILES:
N#CCC(C1CCN(C1)c1nc2cccnc2o1)n1cc(cn1)-c1ncnc2[nH]ccc12
: