Target
Tyrosine-protein kinase JAK1
Ligand
BDBM246870
Substrate
Meas. Tech.
In Vitro JAK Kinase Assay
IC50
<10±n/a nM
Citation
 Li, YMetcalf, BWLi, H Crystalline forms of a PI3K inhibitor US Patent  US10125150 Publication Date 11/13/2018 
Target
Name:
Tyrosine-protein kinase JAK1
Synonyms:
JAK-1 JAK1A JAK1_HUMAN Janus kinase 1 (JAK1) | Janus kinase 1 JAK1
Type:
Protein
Mol. Mass.:
133293.73
Organism:
Homo sapiens (Human)
Description:
P23458
Residue:
1154
  
Inhibitor
Name:
BDBM246870
Synonyms:
US10053465, 9 US10125150, Example 9 US10479803, Example 9 US11084822, Example 9 US11136326, Example 9 US11304949, Compound 3 US11406640, Comp. No. 3 US20240058343, Compound 3 US9999619, Example 86 | [3-[4-(7H- pyrrolo[2,3- d]pyrimidin-4-yl)- 1H-pyrazol-1-yl]-1- (1-{[2- (trifluoromethyl) pyrimidin-4- yl]carbonyl} piperidin-4-yl) azetidin-3- yl]acetonitrile
Type:
Small organic molecule
Emp. Form.:
C25H23F3N10O
Mol. Mass.:
536.5117
SMILES:
FC(F)(F)c1nccc(n1)C(=O)N1CCC(CC1)N1CC(CC#N)(C1)n1cc(cn1)-c1ncnc2[nH]ccc12
: