Target
Tyrosine-protein kinase JAK1
Ligand
BDBM246879
Substrate
Meas. Tech.
In Vitro JAK Kinase Assay
IC50
<10±n/a nM
Citation
 Li, YMetcalf, BWLi, H Crystalline forms of a PI3K inhibitor US Patent  US10125150 Publication Date 11/13/2018 
Target
Name:
Tyrosine-protein kinase JAK1
Synonyms:
JAK-1 JAK1A JAK1_HUMAN Janus kinase 1 (JAK1) | Janus kinase 1 JAK1
Type:
Protein
Mol. Mass.:
133293.73
Organism:
Homo sapiens (Human)
Description:
P23458
Residue:
1154
  
Inhibitor
Name:
BDBM246879
Synonyms:
US10053465, 18 US10125150, Example 18 US10479803, Example 18 US10675284, Example 18 US11130767, # 18 US11304949, Compound 18 US11406640, Comp. No. 18 US20240058343, Compound 18 {1-(cis-4-{[6-(2- hydroxyethyl)-2- (trifluoromethyl) pyrimidin-4- yl]oxy}cyclohexyl)- 3-[4-(7H-pyrrolo[2,3- d]pyrimidin-4-yl)- 1H-pyrazol-1- yl]azetidin-3- yl}acetonitrile
Type:
Small organic molecule
Emp. Form.:
C27H28F3N9O2
Mol. Mass.:
567.5655
SMILES:
OCCc1cc(O[C@H]2CC[C@H](CC2)N2CC(CC#N)(C2)n2cc(cn2)-c2ncnc3[nH]ccc23)nc(n1)C(F)(F)F
: