Target
Retinoic acid receptor alpha
Ligand
BDBM458284
Substrate
Meas. Tech.
Transactivation assays
EC50
9.40±n/a nM
Citation
 Borthwick, ADMills, MTBrown, JTCorcoran, JPDe Castro Vasconcelos Goncalves, MBKalindjian, SB Bicycloheteroaryl-heteroaryl-benzoic acid compounds as retinoic acid receptor beta (RARβ) agonists US Patent  US10752616 Publication Date 8/25/2020 
Target
Name:
Retinoic acid receptor alpha
Synonyms:
NR1B1 RAR-alpha RARA_HUMAN Retinoic acid receptor alpha/Retinoid X receptor alpha Retinoid receptor
Type:
PROTEIN
Mol. Mass.:
50778.87
Organism:
Homo sapiens (Human)
Description:
ChEMBL_1466191
Residue:
462
  
Inhibitor
Name:
BDBM458284
Synonyms:
US10752616, Code No. BHBA-042
Type:
Small organic molecule
Emp. Form.:
C19H14N2O3S
Mol. Mass.:
350.391
SMILES:
Cc1ccc(C)c2oc(cc12)-c1nsc(n1)-c1ccc(cc1)C(O)=O
: