Target
5-hydroxytryptamine receptor 2A
Ligand
BDBM458570
Substrate
Meas. Tech.
Binding Activity Assay
Ki
0.330±n/a nM
Citation
 Yoshinaga, HIkuma, YIkeda, JAdachi, SMitsunuma, HAihara, YBesnard, JBell, AS Condensed lactam derivative US Patent  US10745401 Publication Date 8/18/2020 
Target
Name:
5-hydroxytryptamine receptor 2A
Synonyms:
5-HT-2 5-HT2A 5-hydroxytryptamine receptor 2A (5HT-2A) 5HT2A_HUMAN HTR2A | Serotonin receptor 2A
Type:
undefined
Mol. Mass.:
52607.65
Organism:
Homo sapiens (Human)
Description:
P28223
Residue:
471
  
Inhibitor
Name:
BDBM458570
Synonyms:
US10745401, Example 44 | US11466007, Example 44
Type:
Small organic molecule
Emp. Form.:
C21H26N6OS
Mol. Mass.:
410.536
SMILES:
Cn1ncc2c1CCCN(CCN1CCN(CC1)c1nsc3ccccc13)C2=O
: