Target
5-hydroxytryptamine receptor 1A
Ligand
BDBM458577
Substrate
Meas. Tech.
Binding Activity Assay
Ki
0.230±n/a nM
Citation
 Yoshinaga, HIkuma, YIkeda, JAdachi, SMitsunuma, HAihara, YBesnard, JBell, AS Condensed lactam derivative US Patent  US10745401 Publication Date 8/18/2020 
Target
Name:
5-hydroxytryptamine receptor 1A
Synonyms:
5-HT-1A 5-hydroxytryptamine receptor 1A (5-HT-1A) ADRB2RL1 Dopamine D2 receptor and serotonin 1a receptor HTR1A | Serotonin receptor 1A
Type:
Mol. Mass.:
46122.49
Organism:
Homo sapiens (Human)
Description:
Residue:
422
  
Inhibitor
Name:
BDBM458577
Synonyms:
US10745401, Example 51 | US11466007, Example 51
Type:
Small organic molecule
Emp. Form.:
C20H23N5O2S
Mol. Mass.:
397.494
SMILES:
Cc1nc2c(CCN(CCN3CCN(CC3)c3nsc4ccccc34)C2=O)o1
: