Target
5-hydroxytryptamine receptor 2A
Ligand
BDBM458587
Substrate
Meas. Tech.
Binding Activity Assay
Ki
0.230±n/a nM
Citation
 Yoshinaga, HIkuma, YIkeda, JAdachi, SMitsunuma, HAihara, YBesnard, JBell, AS Condensed lactam derivative US Patent  US10745401 Publication Date 8/18/2020 
Target
Name:
5-hydroxytryptamine receptor 2A
Synonyms:
5-HT-2 5-HT2A 5-hydroxytryptamine receptor 2A (5HT-2A) 5HT2A_HUMAN HTR2A | Serotonin receptor 2A
Type:
undefined
Mol. Mass.:
52607.65
Organism:
Homo sapiens (Human)
Description:
P28223
Residue:
471
  
Inhibitor
Name:
BDBM458587
Synonyms:
US10745401, Example 61 | US11466007, Example 61
Type:
Small organic molecule
Emp. Form.:
C21H25N5OS
Mol. Mass.:
395.521
SMILES:
Cn1ccc2c1CCN(CCN1CCN(CC1)c1nsc3ccccc13)C2=O
: