Target
5-hydroxytryptamine receptor 1A
Ligand
BDBM458613
Substrate
Meas. Tech.
Binding Activity Assay
Ki
0.120±n/a nM
Citation
 Yoshinaga, HIkuma, YIkeda, JAdachi, SMitsunuma, HAihara, YBesnard, JBell, AS Condensed lactam derivative US Patent  US10745401 Publication Date 8/18/2020 
Target
Name:
5-hydroxytryptamine receptor 1A
Synonyms:
5-HT-1A 5-hydroxytryptamine receptor 1A (5-HT-1A) ADRB2RL1 Dopamine D2 receptor and serotonin 1a receptor HTR1A | Serotonin receptor 1A
Type:
Mol. Mass.:
46122.49
Organism:
Homo sapiens (Human)
Description:
Residue:
422
  
Inhibitor
Name:
BDBM458613
Synonyms:
US10745401, Example 87 | US11466007, Example 87
Type:
Small organic molecule
Emp. Form.:
C23H26N4O2
Mol. Mass.:
390.4781
SMILES:
Cc1nccc2CCN(CCN3CCC(CC3)c3noc4ccccc34)C(=O)c12
: