Target
5-hydroxytryptamine receptor 1A
Ligand
BDBM458634
Substrate
Meas. Tech.
Binding Activity Assay
Ki
0.160±n/a nM
Citation
 Yoshinaga, HIkuma, YIkeda, JAdachi, SMitsunuma, HAihara, YBesnard, JBell, AS Condensed lactam derivative US Patent  US10745401 Publication Date 8/18/2020 
Target
Name:
5-hydroxytryptamine receptor 1A
Synonyms:
5-HT-1A 5-hydroxytryptamine receptor 1A (5-HT-1A) ADRB2RL1 Dopamine D2 receptor and serotonin 1a receptor HTR1A | Serotonin receptor 1A
Type:
Mol. Mass.:
46122.49
Organism:
Homo sapiens (Human)
Description:
Residue:
422
  
Inhibitor
Name:
BDBM458634
Synonyms:
2-{2-[4-(1,2-Benzoisothiazol-3-yl)piperazin-1-yl]ethyl}-6-methyl-3,4-dihydro-2,7-naphthyridin-1(2H)-one US11466007, Example 108
Type:
Small organic molecule
Emp. Form.:
C22H25N5OS
Mol. Mass.:
407.532
SMILES:
Cc1cc2CCN(CCN3CCN(CC3)c3nsc4ccccc34)C(=O)c2cn1
: