Target
5-hydroxytryptamine receptor 2A
Ligand
BDBM458718
Substrate
Meas. Tech.
Binding Activity Assay
Ki
0.340±n/a nM
Citation
 Yoshinaga, HIkuma, YIkeda, JAdachi, SMitsunuma, HAihara, YBesnard, JBell, AS Condensed lactam derivative US Patent  US10745401 Publication Date 8/18/2020 
Target
Name:
5-hydroxytryptamine receptor 2A
Synonyms:
5-HT-2 5-HT2A 5-hydroxytryptamine receptor 2A (5HT-2A) 5HT2A_HUMAN HTR2A | Serotonin receptor 2A
Type:
undefined
Mol. Mass.:
52607.65
Organism:
Homo sapiens (Human)
Description:
P28223
Residue:
471
  
Inhibitor
Name:
BDBM458718
Synonyms:
5-{2-[4-(1,2-Benzoisoxazol-3-yl)piperidin-1-yl]ethyl}-6,7-dihydro[1,3]imidazolo[4,5-c]pyridin-4(5H)-one US11466007, Example 191
Type:
Small organic molecule
Emp. Form.:
C20H23N5O2
Mol. Mass.:
365.4289
SMILES:
O=C1N(CCN2CCC(CC2)c2noc3ccccc23)CCc2[nH]cnc12
: