Target
Tyrosine-protein kinase JAK1 [850-1154]
Ligand
BDBM458908
Substrate
Meas. Tech.
In Vitro JAK kinase Assays
IC50
7.00±n/a nM
Citation
 Esteve Trias, CTaltavull Moll, JGonzalez Rodriguez, JVidal Juan, B 2-(pyrazolopyridin-3-yl)pyrimidine derivatives as JAK inhibitors US Patent  US10759793 Publication Date 9/1/2020 
Target
Name:
Tyrosine-protein kinase JAK1 [850-1154]
Synonyms:
JAK1 JAK1B Tyrosine-protein kinase JAK1 (850-1154)
Type:
Enzyme Catalytic Domain
Mol. Mass.:
34949.64
Organism:
Description:
aa 850-1154
Residue:
305
 
Inhibitor
Name:
BDBM458908
Synonyms:
US10759793, Example 54
Type:
Small organic molecule
Emp. Form.:
C23H22FN9O2
Mol. Mass.:
475.4783
SMILES:
OCCOc1nc(nc(N[C@@H]2CCCN(C2)c2cnc(cn2)C#N)c1F)-c1cnn2ccccc12
: