Target
Bile acid receptor
Ligand
BDBM461252
Substrate
Meas. Tech.
Mammalian One Hybrid (M1H) Assay
EC50
353±n/a nM
Citation
 Blomgren, PACurrie, KSGege, CKropf, JEXu, J FXR (NR1H4) modulating compounds US Patent  US10774054 Publication Date 9/15/2020 
Target
Name:
Bile acid receptor
Synonyms:
BAR FXR HRR1 NR1H4_HUMAN RIP14 Retinoid X receptor-interacting protein 14 | farnesoid x receptor
Type:
Nuclear Receptor
Mol. Mass.:
55916.24
Organism:
Homo sapiens (Human)
Description:
Q96RI1
Residue:
486
  
Inhibitor
Name:
BDBM461252
Synonyms:
5-((1S,3S)-3-(2-chloro-4-((5- cyclopropyl-3-(2,6-dichloro-4- fluorophenyl)isoxazol-4- yl)methoxy)phenyl)-3- hydroxycyclobutyl)-6- methoxynicotinic acid US10981881, Example 6
Type:
Small organic molecule
Emp. Form.:
C29H24Cl3FN2O4
Mol. Mass.:
589.869
SMILES:
COc1ncccc1[C@H]1C[C@@](O)(C1)c1ccc(OCc2c(onc2-c2c(Cl)cc(F)cc2Cl)C2CC2)cc1Cl
: