Target
Bile acid receptor
Ligand
BDBM461253
Substrate
Meas. Tech.
Mammalian One Hybrid (M1H) Assay
EC50
1696±n/a nM
Citation
 Blomgren, PACurrie, KSGege, CKropf, JEXu, J FXR (NR1H4) modulating compounds US Patent  US10774054 Publication Date 9/15/2020 
Target
Name:
Bile acid receptor
Synonyms:
BAR FXR HRR1 NR1H4_HUMAN RIP14 Retinoid X receptor-interacting protein 14 | farnesoid x receptor
Type:
Nuclear Receptor
Mol. Mass.:
55916.24
Organism:
Homo sapiens (Human)
Description:
Q96RI1
Residue:
486
  
Inhibitor
Name:
BDBM461253
Synonyms:
2-(6-(3-(2-chloro-4-((5- cyclopropyl-3-(2,6-dichloro-4- fluorophenyl)isoxazol-4- yl)methoxy)phenyl)-3- hydroxyazetidin-1-yl)-5- fluoronicotinamido)ethane-1- sulfonic acid US10981881, Example 7
Type:
Small organic molecule
Emp. Form.:
C30H25Cl3F2N4O7S
Mol. Mass.:
729.963
SMILES:
OC1(CN(C1)c1ncc(cc1F)C(=O)NCCS(O)(=O)=O)c1ccc(OCc2c(onc2-c2c(Cl)cc(F)cc2Cl)C2CC2)cc1Cl
: