Target
Bile acid receptor
Ligand
BDBM461254
Substrate
Meas. Tech.
Mammalian One Hybrid (M1H) Assay
EC50
1264±n/a nM
Citation
 Blomgren, PACurrie, KSGege, CKropf, JEXu, J FXR (NR1H4) modulating compounds US Patent  US10774054 Publication Date 9/15/2020 
Target
Name:
Bile acid receptor
Synonyms:
BAR FXR HRR1 NR1H4_HUMAN RIP14 Retinoid X receptor-interacting protein 14 | farnesoid x receptor
Type:
Nuclear Receptor
Mol. Mass.:
55916.24
Organism:
Homo sapiens (Human)
Description:
Q96RI1
Residue:
486
  
Inhibitor
Name:
BDBM461254
Synonyms:
(6-(3-(2-chloro-4-((5- cyclopropyl-3-(2,6-dichloro-4- fluorophenyl)isoxazol-4- yl)methoxy)phenyl)-3- hydroxyazetidin-1-yl)-5- fluoronicotinoyl)glycine US10981881, Example 8
Type:
Small organic molecule
Emp. Form.:
C30H23Cl3F2N4O6
Mol. Mass.:
679.883
SMILES:
OC(=O)CNC(=O)c1cnc(N2CC(O)(C2)c2ccc(OCc3c(onc3-c3c(Cl)cc(F)cc3Cl)C3CC3)cc2Cl)c(F)c1
: