Target
Plasma kallikrein
Ligand
BDBM392533
Substrate
Meas. Tech.
In Vitro Enzyme Inhibition
IC50
<100±n/a nM
Citation
 McDonald, AQian, S Therapeutic inhibitory compounds US Patent  US10781200 Publication Date 9/22/2020 
Target
Name:
Plasma kallikrein
Synonyms:
Fletcher factor KLKB1 Kallikrein Plasma kallikrein heavy chain Plasma prekallikrein
Type:
Protein
Mol. Mass.:
71391.16
Organism:
Homo sapiens (Human)
Description:
P03952
Residue:
638
  
Inhibitor
Name:
BDBM392533
Synonyms:
4-acetamido-N-((6-amino-2,4- dimethylpyridin-3-yl)methyl)-1-((3- chloroquinolin-6-yl)methyl)-1H- pyrazole-3-carboxamide US10781200, Example 19
Type:
Small organic molecule
Emp. Form.:
C24H24ClN7O2
Mol. Mass.:
477.946
SMILES:
CC(=O)Nc1cn(Cc2ccc3ncc(Cl)cc3c2)nc1C(=O)NCc1c(C)cc(N)nc1C
: