Target
Tyrosine-protein kinase receptor UFO
Ligand
BDBM299917
Substrate
Meas. Tech.
Enzyme Assay
Ki
0.020±n/a nM
Citation
 Johnson, TWRichardson, PFCollins, MRRichter, DTBurke, BJNinkovic, SGajiwala, KSLinton, MALe, PTHoffman, JE Axl inhibitors US Patent  US9593097 Publication Date 3/14/2017 
Target
Name:
Tyrosine-protein kinase receptor UFO
Synonyms:
AXL TEL/AXL UFO | UFO_HUMAN
Type:
Enzyme
Mol. Mass.:
98316.97
Organism:
Homo sapiens (Human)
Description:
P30530
Residue:
894
  
Inhibitor
Name:
BDBM299917
Synonyms:
4-[4-({[2-amino-5- (1-methyl-1H- imidazol-4- yl)pyridin-3- yl]oxy}methyl) piperidin-1-yl]-N- tert-butyl-6-[(1- cyanocyclopropyl) methoxy]-1,3,5- triazine-2- carboxamide | US9593097, Example 287
Type:
Small organic molecule
Emp. Form.:
C28H36N10O3
Mol. Mass.:
560.6506
SMILES:
Cn1cnc(c1)-c1cnc(N)c(OCC2CCN(CC2)c2nc(OCC3(CC3)C#N)nc(n2)C(=O)NC(C)(C)C)c1
: