Target
Tyrosine-protein kinase receptor UFO
Ligand
BDBM300056
Substrate
Meas. Tech.
Enzyme Assay
Ki
0.034±n/a nM
Citation
 Johnson, TWRichardson, PFCollins, MRRichter, DTBurke, BJNinkovic, SGajiwala, KSLinton, MALe, PTHoffman, JE Axl inhibitors US Patent  US9593097 Publication Date 3/14/2017 
Target
Name:
Tyrosine-protein kinase receptor UFO
Synonyms:
AXL TEL/AXL UFO | UFO_HUMAN
Type:
Enzyme
Mol. Mass.:
98316.97
Organism:
Homo sapiens (Human)
Description:
P30530
Residue:
894
  
Inhibitor
Name:
BDBM300056
Synonyms:
N-(3-amino-3- methylbutan-2-yl)- 2-{[(2R)-1- methoxypropan-2- yl]oxy}-6-[4-(4- methoxy-1H- pyrrolo[2,3- b]pyridin-3- yl)piperidin-1- yl]pyrimidine-4- carboxamide US9593097, Example 437 US9593097, Example 498 | US9593097, Example 499
Type:
Small organic molecule
Emp. Form.:
C27H39N7O4
Mol. Mass.:
525.6431
SMILES:
COC[C@@H](C)Oc1nc(cc(n1)C(=O)NC(C)C(C)(C)N)N1CCC(CC1)c1c[nH]c2nccc(OC)c12
: