Target
Tyrosine-protein kinase receptor UFO
Ligand
BDBM300061
Substrate
Meas. Tech.
Enzyme Assay
Ki
0.040±n/a nM
Citation
 Johnson, TWRichardson, PFCollins, MRRichter, DTBurke, BJNinkovic, SGajiwala, KSLinton, MALe, PTHoffman, JE Axl inhibitors US Patent  US9593097 Publication Date 3/14/2017 
Target
Name:
Tyrosine-protein kinase receptor UFO
Synonyms:
AXL TEL/AXL UFO | UFO_HUMAN
Type:
Enzyme
Mol. Mass.:
98316.97
Organism:
Homo sapiens (Human)
Description:
P30530
Residue:
894
  
Inhibitor
Name:
BDBM300061
Synonyms:
N-(3-amino-3- methylbutan-2-yl)- 2-[(1- cyanocyclopropyl) methoxy]-6-[4-(4- methoxy-1H- pyrrolo[2,3- b]pyridin-3- yl)piperidin-1- yl]pyrimidine-4- carboxamide US9593097, Example 442
Type:
Small organic molecule
Emp. Form.:
C28H36N8O3
Mol. Mass.:
532.6372
SMILES:
COc1ccnc2[nH]cc(C3CCN(CC3)c3cc(nc(OCC4(CC4)C#N)n3)C(=O)NC(C)C(C)(C)N)c12
: