Target
Tyrosine-protein kinase receptor UFO
Ligand
BDBM300065
Substrate
Meas. Tech.
Enzyme Assay
Ki
0.049±n/a nM
Citation
 Johnson, TWRichardson, PFCollins, MRRichter, DTBurke, BJNinkovic, SGajiwala, KSLinton, MALe, PTHoffman, JE Axl inhibitors US Patent  US9593097 Publication Date 3/14/2017 
Target
Name:
Tyrosine-protein kinase receptor UFO
Synonyms:
AXL TEL/AXL UFO | UFO_HUMAN
Type:
Enzyme
Mol. Mass.:
98316.97
Organism:
Homo sapiens (Human)
Description:
P30530
Residue:
894
  
Inhibitor
Name:
BDBM300065
Synonyms:
(trans)-N-(2- hydroxy- cyclobutyl)- 2-{[(2R)-1- methoxypropan-2- yl]oxy}-6-[4-(4- methoxy-1H- pyrazolo[3,4- b]pyridin-3- yl)piperidin-1- yl]pyrimidine-4- carboxamide US9593097, Example 445 | US9593097, Example 446
Type:
Small organic molecule
Emp. Form.:
C25H33N7O5
Mol. Mass.:
511.5734
SMILES:
COC[C@@H](C)Oc1nc(cc(n1)C(=O)NC1CCC1O)N1CCC(CC1)c1n[nH]c2nccc(OC)c12
: