Target
Rho-associated protein kinase 2
Ligand
BDBM464289
Substrate
Meas. Tech.
In Vitro Assay
IC50
<3±n/a nM
Citation
 Bhide, RSBodas, MSShirude, PSPatil, SMaishal, TKThiyagarajan, KChinnakotti, KGlunz, PW Spiro-fused cyclic ureas as inhibitors of rock US Patent  US10787450 Publication Date 9/29/2020 
Target
Name:
Rho-associated protein kinase 2
Synonyms:
KIAA0619 ROCK2 Rho kinase 2 (ROCKII) Rho-associated protein kinase 2 (ROCK2) Rho-associated protein kinase 2/Transforming protein RhoA Rho-associated, coiled-coil-containing protein kinase II p164 ROCK-2
Type:
Protein
Mol. Mass.:
160885.43
Organism:
Homo sapiens (Human)
Description:
O75116
Residue:
1388
  
Inhibitor
Name:
BDBM464289
Synonyms:
3-(4-(1H-pyrazol-4-yl)phenyl)-8-(4,4-difluorocyclohexanecarbonyl)-1-(3-methoxybenzyl)-1,3,8-triazaspiro[4.5]decan-2-one | US10787450, Example 171
Type:
Small organic molecule
Emp. Form.:
C28H32BrF2N3O3
Mol. Mass.:
576.473
SMILES:
COc1cccc(CN2C(=O)N(CC22CCN(CC2)C(=O)C2CCC(F)(F)CC2)c2ccc(Br)cc2)c1
: