Target
Rho-associated protein kinase 2
Ligand
BDBM464355
Substrate
Meas. Tech.
In Vitro Assay
IC50
<3±n/a nM
Citation
 Bhide, RSBodas, MSShirude, PSPatil, SMaishal, TKThiyagarajan, KChinnakotti, KGlunz, PW Spiro-fused cyclic ureas as inhibitors of rock US Patent  US10787450 Publication Date 9/29/2020 
Target
Name:
Rho-associated protein kinase 2
Synonyms:
KIAA0619 ROCK2 Rho kinase 2 (ROCKII) Rho-associated protein kinase 2 (ROCK2) Rho-associated protein kinase 2/Transforming protein RhoA Rho-associated, coiled-coil-containing protein kinase II p164 ROCK-2
Type:
Protein
Mol. Mass.:
160885.43
Organism:
Homo sapiens (Human)
Description:
O75116
Residue:
1388
  
Inhibitor
Name:
BDBM464355
Synonyms:
3-(5-(1H- pyrazol-4- yl)pyridin- 2-yl)-1-(3- methoxy- benzyl)-8- (oxetan-3- yl)-1,3,8- triazaspiro [4.5]decan- 2-one | US10787450, Example 237
Type:
Small organic molecule
Emp. Form.:
C26H30N6O3
Mol. Mass.:
474.5548
SMILES:
COc1cccc(CN2C(=O)N(CC22CCN(CC2)C2COC2)c2ccc(cn2)-c2cn[nH]c2)c1
: