Target
Serine/threonine-protein kinase ATR
Ligand
BDBM411584
Substrate
Meas. Tech.
Inhibition Assay
Ki
505±n/a nM
Citation
 Ahmad, NBoyall, DCharrier, JDavis, CDavis, RDurrant, SEtxebarria I Jardi, GFraysse, DJimenez, JKay, DKnegtel, RMiddleton, DO''Donnell, MPanesar, MPierard, FPinder, JShaw, DStorck, PStudley, JTwin, H Compounds useful as inhibitors of ATR kinase US Patent  US10787452 Publication Date 9/29/2020 
Target
Name:
Serine/threonine-protein kinase ATR
Synonyms:
ATR Ataxia telangiectasia and Rad3-related protein (ATR) FRP1 | Serine-protein kinase ATR
Type:
Protein
Mol. Mass.:
301404.58
Organism:
Homo sapiens (Human)
Description:
Q13535
Residue:
2644
  
Inhibitor
Name:
BDBM411584
Synonyms:
US10392391, Compound I-N-13 US11117900, Compound I-N-13 US20230271963, Compound I-N-13
Type:
Small organic molecule
Emp. Form.:
C19H20F2N8O2
Mol. Mass.:
430.4113
SMILES:
Nc1nn2cc(F)cnc2c1C(=O)Nc1cncc(F)c1N1CCN(CC1)C1COC1
: