Target
Mu-type opioid receptor
Ligand
BDBM464469
Substrate
Meas. Tech.
Receptor Binding Assay
Ki
130±n/a nM
Citation
 Kuehnert, SKoenigs, RMJakob, FKless, AWegert, ARatcliffe, PJostock, RKoch, TLinz, KSchroeder, W 3-((hetero-)aryl)-8-amino-2-oxo-1,3-diaza-spiro-[4.5]-decane derivatives US Patent  US10793528 Publication Date 10/6/2020 
Target
Name:
Mu-type opioid receptor
Synonyms:
M-OR-1 MOR-1 MUOR1 Mu opiate receptor OPRM1 hMOP | mu-type opioid receptor isoform MOR-1
Type:
G Protein-Coupled Receptor (GPCR)
Mol. Mass.:
44789.51
Organism:
Homo sapiens (Human)
Description:
P35372
Residue:
400
  
Inhibitor
Name:
BDBM464469
Synonyms:
US10793528, Example SC_5039
Type:
Small organic molecule
Emp. Form.:
C26H42N4O5S
Mol. Mass.:
522.7
SMILES:
COCCCN1C(=O)N(CCC(=O)NCCS(C)(=O)=O)C[C@]11CC[C@@](CC1)(N(C)C)c1ccccc1
: