Target
Membrane primary amine oxidase
Ligand
BDBM385387
Substrate
Meas. Tech.
In Vitro Activity Assay
IC50
12.0±1 nM
Citation
 Coates, DAQin, LHWei, YZhou, J Amino pyrimidine ssao inhibitors US Patent  US10793552 Publication Date 10/6/2020 
Target
Name:
Membrane primary amine oxidase
Synonyms:
AOC3 Amine oxidase, copper containing Semicarbazide-sensitive amine oxidase/ Vascular adhesion protein 1 (SSAO/VAP-1) Vascular adhesion protein 1 (VAP-1)
Type:
Protein
Mol. Mass.:
84620.86
Organism:
Homo sapiens (Human)
Description:
Q16853
Residue:
763
  
Inhibitor
Name:
BDBM385387
Synonyms:
(E)-3-Fluoro-2-[[2-(4-methoxy-1-piperidyl)pyrimidin-5-yl]oxymethyl]prop-2-en-1-amine, Dihydrochloride US10464928, Example 3 | US10793552, Example 3
Type:
Small organic molecule
Emp. Form.:
C14H21FN4O2
Mol. Mass.:
296.3405
SMILES:
COC1CCN(CC1)c1ncc(OC\C(CN)=C\F)cn1
: