Target
Adenosine receptor A1
Ligand
BDBM464677
Substrate
Meas. Tech.
Radioligand Binding Competition Assay
IC50
181±n/a nM
Citation
 Pham, SMChen, JAnsari, AJadhavar, PSPatil, VSKhan, FRamachandran, SAAgarwal, AKChakravarty, S 1,8-naphthyridinone compounds and uses thereof US Patent  US10793561 Publication Date 10/6/2020 
Target
Name:
Adenosine receptor A1
Synonyms:
A1 adenosine receptor (hA1) AA1R_HUMAN ADORA1 Adenosine A1-receptor Adenosine receptor A1 (hA1) | Adenosine transporter (AdT)
Type:
G Protein-Coupled Receptor (GPCR)
Mol. Mass.:
36520.92
Organism:
Homo sapiens (Human)
Description:
P30542
Residue:
326
  
Inhibitor
Name:
BDBM464677
Synonyms:
US10793561, Compound 1.5
Type:
Small organic molecule
Emp. Form.:
C24H17N3O2
Mol. Mass.:
379.4107
SMILES:
COc1ccc2cc(ccc2n1)-c1cc2c(nc1-c1ccccc1)[nH]ccc2=O
: