Target
Non-receptor tyrosine-protein kinase TYK2 [556-888]
Ligand
BDBM399582
Substrate
Meas. Tech.
TYK2 JH2 Domain Binding Assay
Kd
0.3±n/a nM
Citation
 Greenwood, JRHarriman, GCLeit de Moradei, SMMasse, CEMcLean, THMondal, S TYK2 inhibitors and uses thereof US Patent  US10793574 Publication Date 10/6/2020 
Target
Name:
Non-receptor tyrosine-protein kinase TYK2 [556-888]
Synonyms:
Non-receptor tyrosine-protein kinase TYK2 (G556-D888) TYK2 TYK2_HUMAN
Type:
Protein
Mol. Mass.:
36941.98
Organism:
Homo sapiens (Human)
Description:
P29597 (aa 556-888)
Residue:
333
  
Inhibitor
Name:
BDBM399582
Synonyms:
US10323036, Compound I-25 | US10793574, Compound I-25
Type:
Small organic molecule
Emp. Form.:
C23H20N10O2
Mol. Mass.:
468.4707
SMILES:
COc1c(Nc2cc(Nc3ccc(cn3)C#N)nc3[nH]n(C)c(=O)c23)cccc1-c1ncn(C)n1
: