Target
Interleukin-1 receptor-associated kinase 4
Ligand
BDBM403050
Substrate
Meas. Tech.
Enzymatic DELFIA Assay
IC50
0.400±n/a nM
Citation
 Trzupek, JDLee, KLBunnage, MEHan, SHepworth, DLovering, FEMathias, JPPapaioannou, NPierce, BSStrohbach, JWWright, SWZapf, CWGavrin, LKLee, AAnderson, DRCurran, KJDehnhardt, CMSaiah, EGoldberg, JAWang, XHuang, HVargas, RLowe, MDPatny, A Bicyclic-fused heteroaryl or aryl compounds US Patent  US10793579 Publication Date 10/6/2020 
Target
Name:
Interleukin-1 receptor-associated kinase 4
Synonyms:
IRAK-4 IRAK4_HUMAN Interleukin-1 receptor-associated kinase 4 (IRAK4) | Renal carcinoma antigen NY-REN-64
Type:
Protein
Mol. Mass.:
51519.08
Organism:
Homo sapiens (Human)
Description:
Q9NWZ3
Residue:
460
  
Inhibitor
Name:
BDBM403050
Synonyms:
US10329302, Example 201 US11702424, Example 201
Type:
Small organic molecule
Emp. Form.:
C20H23F2N3O4
Mol. Mass.:
407.4111
SMILES:
CC[C@H]1[C@@H](COc2nccc3cc(C(N)=O)c(OC(C)C)cc23)NC(=O)C1(F)F
: