Target
Interleukin-1 receptor-associated kinase 4
Ligand
BDBM403211
Substrate
Meas. Tech.
Enzymatic DELFIA Assay
IC50
0.400±n/a nM
Citation
 Trzupek, JDLee, KLBunnage, MEHan, SHepworth, DLovering, FEMathias, JPPapaioannou, NPierce, BSStrohbach, JWWright, SWZapf, CWGavrin, LKLee, AAnderson, DRCurran, KJDehnhardt, CMSaiah, EGoldberg, JAWang, XHuang, HVargas, RLowe, MDPatny, A Bicyclic-fused heteroaryl or aryl compounds US Patent  US10793579 Publication Date 10/6/2020 
Target
Name:
Interleukin-1 receptor-associated kinase 4
Synonyms:
IRAK-4 IRAK4_HUMAN Interleukin-1 receptor-associated kinase 4 (IRAK4) | Renal carcinoma antigen NY-REN-64
Type:
Protein
Mol. Mass.:
51519.08
Organism:
Homo sapiens (Human)
Description:
Q9NWZ3
Residue:
460
  
Inhibitor
Name:
BDBM403211
Synonyms:
US10329302, Example 367 US11702424, Example 367
Type:
Small organic molecule
Emp. Form.:
C17H17F2N3O4
Mol. Mass.:
365.3314
SMILES:
COc1cc2c(OC[C@H]3NC(=O)[C@@H](F)[C@H]3CF)nccc2cc1C(N)=O
: