Target
Short transient receptor potential channel 6
Ligand
BDBM466653
Substrate
Meas. Tech.
High Throughput Screening Assay
IC50
630±n/a nM
Citation
 Bouyssou, TGottschling, DHeine, NKeenan, LLLowe, MDRazavi, HSarko, CRSurprenant, STakahashi, HTurner, MRWu, X Inhibitors of TRPC6 US Patent  US10800757 Publication Date 10/13/2020 
Target
Name:
Short transient receptor potential channel 6
Synonyms:
TRP-6 TRPC6 Transient receptor protein 6
Type:
PROTEIN
Mol. Mass.:
106326.67
Organism:
Homo sapiens (Human)
Description:
ChEMBL_107640
Residue:
931
  
Inhibitor
Name:
BDBM466653
Synonyms:
US10800757, Compound 69 [(R)-4-(6-Amino-4-methoxy-pyridin-3- yl)-2-hydroxymethyl-piperazin-1-yl]- (4-methoxy-5-phenoxy-pyridin-2-yl)- methanone
Type:
Small organic molecule
Emp. Form.:
C24H27N5O5
Mol. Mass.:
465.5017
SMILES:
COc1cc(ncc1Oc1ccccc1)C(=O)N1CCN(C[C@@H]1CO)c1cnc(N)cc1OC
: