Target
Thyroid hormone receptor beta
Ligand
BDBM466857
Substrate
Meas. Tech.
Time-Resolved Fluorescence Resonance Energy Transfer (TR-FRET) Assay for Thyroid Hormone Receptor Agonist Screening
EC50
44.2±n/a nM
Citation
 Kirschberg, TAHalcomb, RXu, YRomero, FA Thyroid hormone receptor beta agonist compounds US Patent  US10800767 Publication Date 10/13/2020 
Target
Name:
Thyroid hormone receptor beta
Synonyms:
ERBA2 Nuclear receptor subfamily 1 group A member 2 THR1 c-erbA-2 | c-erbA-beta
Type:
Receptor
Mol. Mass.:
52793.62
Organism:
Homo sapiens (Human)
Description:
Recombinant hThR was obtained from nuclear extracts from SF9 cells infected with baculovirus vectors encoding for ThRbeta 1.
Residue:
461
  
Inhibitor
Name:
BDBM466857
Synonyms:
US10800767, Example 1 | US10800767, Example 16
Type:
Small organic molecule
Emp. Form.:
C17H17Cl2N5O4
Mol. Mass.:
426.254
SMILES:
CC(C)c1cc(Oc2c(Cl)cc(NCc3noc(=O)[nH]3)cc2Cl)nn(C)c1=O
: