Target
Thyroid hormone receptor beta
Ligand
BDBM466880
Substrate
Meas. Tech.
Time-Resolved Fluorescence Resonance Energy Transfer (TR-FRET) Assay for Thyroid Hormone Receptor Agonist Screening
EC50
188±n/a nM
Citation
 Kirschberg, TAHalcomb, RXu, YRomero, FA Thyroid hormone receptor beta agonist compounds US Patent  US10800767 Publication Date 10/13/2020 
Target
Name:
Thyroid hormone receptor beta
Synonyms:
ERBA2 Nuclear receptor subfamily 1 group A member 2 THR1 c-erbA-2 | c-erbA-beta
Type:
Receptor
Mol. Mass.:
52793.62
Organism:
Homo sapiens (Human)
Description:
Recombinant hThR was obtained from nuclear extracts from SF9 cells infected with baculovirus vectors encoding for ThRbeta 1.
Residue:
461
  
Inhibitor
Name:
BDBM466880
Synonyms:
US10800767, Example 24
Type:
Small organic molecule
Emp. Form.:
C20H20ClN5O5
Mol. Mass.:
445.856
SMILES:
CC(C)c1cc(Oc2c3CCCc3c(NC(=O)c3noc(=O)[nH]3)cc2Cl)nn(C)c1=O
: