Target
Metabotropic glutamate receptor 5
Ligand
BDBM300232
Substrate
Meas. Tech.
Radioligand Binding Assay
IC50
24.8±n/a nM
Citation
 Riva, CDe Toma, CAngelico, PPoggesi, EGraziani, D Heterocyclylalkyne derivatives and their use as modulators of mGluR5 receptors US Patent  US9593127 Publication Date 3/14/2017 
Target
Name:
Metabotropic glutamate receptor 5
Synonyms:
GPRC1E GRM5_HUMAN metabotropic glutamate 5 | metabotropic glutamate 5a
Type:
Enzyme
Mol. Mass.:
132484.72
Organism:
Homo sapiens (Human)
Description:
Residue:
1212
  
Inhibitor
Name:
BDBM300232
Synonyms:
US9593127, Example 6 | [3-[2-(3-chlorophenyl)ethynyl]- 3a,4,5,6a- tetrahydropyrrolo[3,2- d]isoxazol-6-yl]-morpholino- methanone
Type:
Small organic molecule
Emp. Form.:
C18H18ClN3O3
Mol. Mass.:
359.807
SMILES:
Clc1cccc(c1)C#CC1=NOC2C1CCN2C(=O)N1CCOCC1
: