Target
Metabotropic glutamate receptor 5
Ligand
BDBM300240
Substrate
Meas. Tech.
Radioligand Binding Assay
IC50
14.8±n/a nM
Citation
 Riva, CDe Toma, CAngelico, PPoggesi, EGraziani, D Heterocyclylalkyne derivatives and their use as modulators of mGluR5 receptors US Patent  US9593127 Publication Date 3/14/2017 
Target
Name:
Metabotropic glutamate receptor 5
Synonyms:
GPRC1E GRM5_HUMAN metabotropic glutamate 5 | metabotropic glutamate 5a
Type:
Enzyme
Mol. Mass.:
132484.72
Organism:
Homo sapiens (Human)
Description:
Residue:
1212
  
Inhibitor
Name:
BDBM300240
Synonyms:
N,N-diethyl-3-[2-(m- tolyl)ethynyl]-3a,4,5,6a- tetrahydropyrrolo[3,2- d]isoxazole-6-carboxamide | US9593127, Example 14
Type:
Small organic molecule
Emp. Form.:
C19H23N3O2
Mol. Mass.:
325.4048
SMILES:
CCN(CC)C(=O)N1CCC2C1ON=C2C#Cc1cccc(C)c1
: