Target
Beta-lactamase
Ligand
BDBM466996
Substrate
Meas. Tech.
Inhibition of Beta-Lactamase Enzymes
IC50
14.0±n/a nM
Citation
 Comita-Prevoir, JDurand-Reville, TFGauthier, LO''Donnell, JRomero, JTommasi, RVerheijen, JCWu, FWu, XZhang, J Beta-lactamase inhibitor compounds US Patent  US10800778 Publication Date 10/13/2020 
Target
Name:
Beta-lactamase
Synonyms:
AMPC_ECOLI Beta-lactamase (AmpC) Cephalosporinase ampA | ampC
Type:
Protien
Mol. Mass.:
41561.62
Organism:
Escherichia coli
Description:
P00811
Residue:
377
  
Inhibitor
Name:
BDBM466996
Synonyms:
(2S)-2-fluoro-2-[[(2S,5R)-2-(cyanomethylcarbamoyl)-3-methyl-7-oxo-1,6-diazabicyclo[3.2.1]oct-3-en-6-yl]oxy]acetic acid lithium salt | US10800778, Example 82
Type:
Small organic molecule
Emp. Form.:
C12H13FN4O5
Mol. Mass.:
312.2538
SMILES:
CC1=C[C@@H]2CN([C@@H]1C(=O)NCC#N)C(=O)N2O[C@@H](F)C(O)=O
: