Target
Tyrosine-protein kinase BTK
Ligand
BDBM467249
Substrate
Meas. Tech.
Cell Proliferation Assays
IC50
167±n/a nM
Citation
 Zhao, XZhang, WChen, ZChen, LWang, XLi, ZTan, RYang, LTan, HLiu, BRan, KZou, ZLin, MSun, JWang, W Substituted pyrrolo[2,3-d]pyridazin-4-ones and pyrazolo[3,4-d]pyridazin-4-ones as protein kinase inhibitors US Patent  US10800785 Publication Date 10/13/2020 
Target
Name:
Tyrosine-protein kinase BTK
Synonyms:
AGMX1 Agammaglobulinaemia tyrosine kinase B cell progenitor kinase BPK BTK_HUMAN Tyrosine Kinase BTK Tyrosine-protein kinase BTK (BTK)
Type:
Enzyme
Mol. Mass.:
76289.95
Organism:
Homo sapiens (Human)
Description:
Q06187
Residue:
659
  
Inhibitor
Name:
BDBM467249
Synonyms:
(S)-3-(1-acryloylpiperidin-3-yl)-7-amino-1-(4-(4- fluorophenoxy)phenyl)-1,5-dihydro-4H-pyrrolo [2,3-d]pyridazin-4-one | US10800785, Example 31
Type:
Small organic molecule
Emp. Form.:
C26H24FN5O3
Mol. Mass.:
473.4989
SMILES:
Nc1n[nH]c(=O)c2c(cn(-c3ccc(Oc4ccc(F)cc4)cc3)c12)[C@@H]1CCCN(C1)C(=O)C=C
: