Target
Tyrosine-protein kinase BTK
Ligand
BDBM467256
Substrate
Meas. Tech.
Cell Proliferation Assays
IC50
182±n/a nM
Citation
 Zhao, XZhang, WChen, ZChen, LWang, XLi, ZTan, RYang, LTan, HLiu, BRan, KZou, ZLin, MSun, JWang, W Substituted pyrrolo[2,3-d]pyridazin-4-ones and pyrazolo[3,4-d]pyridazin-4-ones as protein kinase inhibitors US Patent  US10800785 Publication Date 10/13/2020 
Target
Name:
Tyrosine-protein kinase BTK
Synonyms:
AGMX1 Agammaglobulinaemia tyrosine kinase B cell progenitor kinase BPK BTK_HUMAN Tyrosine Kinase BTK Tyrosine-protein kinase BTK (BTK)
Type:
Enzyme
Mol. Mass.:
76289.95
Organism:
Homo sapiens (Human)
Description:
Q06187
Residue:
659
  
Inhibitor
Name:
BDBM467256
Synonyms:
3-(1-acryloylpyrrolidin-3-yl)-7-amino-1-(4-(2,6-difluorophenoxy)phenyl)-1,5-dihydro-4H-pyrazolo[3,4-d]pyridazin-4-one | US10800785, Example 7
Type:
Small organic molecule
Emp. Form.:
C24H20F2N6O3
Mol. Mass.:
478.4508
SMILES:
Nc1n[nH]c(=O)c2c(nn(-c3ccc(Oc4c(F)cccc4F)cc3)c12)C1CCN(C1)C(=O)C=C
: