Target
Ataxin-1
Ligand
BDBM467346
Substrate
Meas. Tech.
Human Atx Enzyme Inhibition Assay
IC50
1.000±n/a nM
Citation
 Mattei, PHert, JHunziker, DRudolph, MSchmitz, PDi Giorgio, P Bicyclic compounds as ATX inhibitors US Patent  US10800786 Publication Date 10/13/2020 
Target
Name:
Ataxin-1
Synonyms:
ATX1 ATXN1 | SCA1
Type:
Protein
Mol. Mass.:
86941.25
Organism:
Homo sapiens (Human)
Description:
P54253
Residue:
815
  
Inhibitor
Name:
BDBM467346
Synonyms:
US10800786, Example 5.00
Type:
Small organic molecule
Emp. Form.:
C29H32N4O5
Mol. Mass.:
516.5882
SMILES:
O=C(N1CC2=C(CN(Cc3ccc4[nH]c(=O)oc4c3)C2)C1)c1cc(OCC2CCOCC2)nc(c1)C1CC1
: