Target
Fibroblast growth factor receptor 3
Ligand
BDBM356516
Substrate
Meas. Tech.
Enzymatic Assay
IC50
<10±n/a nM
Citation
 Yao, WZhang, CXu, MZhuo, JHe, C Substituted imidazopyridazines and benzimidazoles as inhibitors of FGFR3 US Patent  US10813930 Publication Date 10/27/2020 
Target
Name:
Fibroblast growth factor receptor 3
Synonyms:
CD_antigen: CD333 FGFR3 Fibroblast growth factor receptor JTK4
Type:
Protein
Mol. Mass.:
87699.57
Organism:
Homo sapiens (Human)
Description:
P22607
Residue:
806
  
Inhibitor
Name:
BDBM356516
Synonyms:
N-(Pyridin-3-ylmethyl)-3-{1-[3-({[(2,2,2-trifluoroethyl)amino]carbonyl}amino)phenyl]-1H-benzimidazol-5-yl}benzamide US10813930, Ex. No. 5
Type:
Small organic molecule
Emp. Form.:
C29H23F3N6O2
Mol. Mass.:
544.5271
SMILES:
FC(F)(F)CNC(=O)Nc1cccc(c1)-n1cnc2cc(ccc12)-c1cccc(c1)C(=O)NCc1cccnc1
: