Target
Fibroblast growth factor receptor 3
Ligand
BDBM356549
Substrate
Meas. Tech.
Enzymatic Assay
IC50
<10±n/a nM
Citation
 Yao, WZhang, CXu, MZhuo, JHe, C Substituted imidazopyridazines and benzimidazoles as inhibitors of FGFR3 US Patent  US10813930 Publication Date 10/27/2020 
Target
Name:
Fibroblast growth factor receptor 3
Synonyms:
CD_antigen: CD333 FGFR3 Fibroblast growth factor receptor JTK4
Type:
Protein
Mol. Mass.:
87699.57
Organism:
Homo sapiens (Human)
Description:
P22607
Residue:
806
  
Inhibitor
Name:
BDBM356549
Synonyms:
N-Pyridin-3-yl-4-(4-{3-[3-({[(2,2,2-trifluoroethyl)amino]carbonyl}amino)phenyl]imidazo[1,2-b]pyridazin-7-yl}-1H-pyrazol-1-yl)piperidine-1-carboxamide US10813930, Ex. No. 38
Type:
Small organic molecule
Emp. Form.:
C29H27F3N10O2
Mol. Mass.:
604.5857
SMILES:
FC(F)(F)CNC(=O)Nc1cccc(c1)-c1cnc2cc(cnn12)-c1cnn(c1)C1CCN(CC1)C(=O)Nc1cccnc1
: