Target
Dihydroorotate dehydrogenase (quinone), mitochondrial
Ligand
BDBM470552
Substrate
Meas. Tech.
Enzymatic Assay
IC50
1.50±n/a nM
Citation
 Gradl, SNNguyen, DEis, KGünther, JStellfeld, TJanzer, AChristian, SMüller, TSheikh, SEZhou, HJZhao, CSykes, DBFerrara, SJLiu, KKröber, MMerz, CNiehues, MSchäfer, MZimmermann, KNising, CF 2,4,5-trisubstituted 1,2,4-triazolones useful as inhibitors of DHODH US Patent  US10815215 Publication Date 10/27/2020 
Target
Name:
Dihydroorotate dehydrogenase (quinone), mitochondrial
Synonyms:
DHODH Dihydroorotate dehydrogenase Dihydroorotate dehydrogenase, mitochondrial Dihydroorotate oxidase (DHODH) | PYRD_HUMAN
Type:
Enzyme
Mol. Mass.:
42881.33
Organism:
Homo sapiens (Human)
Description:
Q02127
Residue:
395
  
Inhibitor
Name:
BDBM470552
Synonyms:
1-(4-[(2-chloro-6-fluorophenyl)carbamoyl]-2-fluoro-5-{[(2S)-1,1,1-trifluoropropan-2-yl]oxy}phenyl)-4-ethyl-5-oxo-4,5-dihydro-1H-1,2,4-triazole-3-carboxylic acid US11130745, Example 212 | US11713304, Example 212
Type:
Small organic molecule
Emp. Form.:
C21H16ClF5N4O5
Mol. Mass.:
534.821
SMILES:
CCn1c(nn(-c2cc(O[C@@H](C)C(F)(F)F)c(cc2F)C(=O)Nc2c(F)cccc2Cl)c1=O)C(O)=O
: