Target
Tyrosine-protein kinase JAK1
Ligand
BDBM305833
Substrate
Meas. Tech.
Caliper Enzyme Assay
IC50
2254±n/a nM
Citation
 Brown, MFDermenci, AFensome, AGerstenberger, BSHayward, MMOwen, DRWright, SWXing, LHYang, X Pyrazolo[1,5-a]pyrazin-4-yl derivatives US Patent  US10822341 Publication Date 11/3/2020 
Target
Name:
Tyrosine-protein kinase JAK1
Synonyms:
JAK-1 JAK1A JAK1_HUMAN Janus kinase 1 (JAK1) | Janus kinase 1 JAK1
Type:
Protein
Mol. Mass.:
133293.73
Organism:
Homo sapiens (Human)
Description:
P23458
Residue:
1154
  
Inhibitor
Name:
BDBM305833
Synonyms:
5-(4-(14(1s,3r)-1-(Cyanomethyl)-3-methoxycyclobutyl)-1H-pyrazol-4-yl)pyrazolo[1,5-a]pyrazin-6-yl)-1H-pyrazole-3-carboxamide US10822341, Example 32 | US11472809, Example 32
Type:
Small organic molecule
Emp. Form.:
C20H19N9O2
Mol. Mass.:
417.424
SMILES:
CO[C@H]1C[C@](CC#N)(C1)n1cc(cn1)-c1nc(cn2nccc12)-c1cc(n[nH]1)C(N)=O
: