Target
Tyrosine-protein kinase BTK
Ligand
BDBM397286
Substrate
Meas. Tech.
Omnia Assay Protocol for Potency Assessment Against BTK
IC50
<10±n/a nM
Citation
 Singh, JPetter, RCTester, RWKluge, AFMazdiyasni, HWestlin, III, WFNiu, DQiao, L Substituted 2,4-diaminopyrimidines as kinase inhibitors US Patent  US10828300 Publication Date 11/10/2020 
Target
Name:
Tyrosine-protein kinase BTK
Synonyms:
AGMX1 Agammaglobulinaemia tyrosine kinase B cell progenitor kinase BPK BTK_HUMAN Tyrosine Kinase BTK Tyrosine-protein kinase BTK (BTK)
Type:
Enzyme
Mol. Mass.:
76289.95
Organism:
Homo sapiens (Human)
Description:
Q06187
Residue:
659
  
Inhibitor
Name:
BDBM397286
Synonyms:
US10596172, Compound I-359 US11351168, Compound I-359 | US9987276, Compound I-359
Type:
Small organic molecule
Emp. Form.:
C24H25F2N5O4
Mol. Mass.:
485.4832
SMILES:
COCCOCCOc1ccc(Nc2ncc(F)c(Nc3cccc(NC(=O)C=C)c3)n2)cc1F
: