Target
Mu-type opioid receptor
Ligand
BDBM472069
Substrate
Meas. Tech.
Receptor Binding Assay
Ki
16.5±n/a nM
Citation
 Kuehnert, SKoenigs, RMKless, AWegert, ARatcliffe, PJostock, RKoch, TLinz, KSchroeder, WSchiene, KKonetzki, I 3-((hetero-)aryl)-alkyl-8-amino-2-oxo-l,3-diaza-spiro-[4.5]-decane derivatives US Patent  US10829480 Publication Date 11/10/2020 
Target
Name:
Mu-type opioid receptor
Synonyms:
M-OR-1 MOR-1 MUOR1 Mu opiate receptor OPRM1 hMOP | mu-type opioid receptor isoform MOR-1
Type:
G Protein-Coupled Receptor (GPCR)
Mol. Mass.:
44789.51
Organism:
Homo sapiens (Human)
Description:
P35372
Residue:
400
  
Inhibitor
Name:
BDBM472069
Synonyms:
CIS-3-[[8-Dimethylamino-1-[(1-hydroxy-cyclobutyl)-methyl]-2-oxo-8-phenyl-1,3- diazaspiro[4.5]decan-3-yl]-methyl]-benzamide | US10829480, Example SC_2110
Type:
Small organic molecule
Emp. Form.:
C29H38N4O3
Mol. Mass.:
490.637
SMILES:
CN(C)[C@]1(CC[C@]2(CN(Cc3cccc(c3)C(N)=O)C(=O)N2CC2(O)CCC2)CC1)c1ccccc1
: