Target
Cyclin-dependent kinase 5 activator 1
Ligand
BDBM472674
Substrate
Meas. Tech.
Inhibition In Vitro Assay
IC50
>100000±n/a nM
Citation
 Strum, JCJung, D Substituted dihydropyrazino[1 ′,2′:1,5]pyrrolo[2,3-d]pyrimidine-based antiproliferative agents US Patent  US10829490 Publication Date 11/10/2020 
Target
Name:
Cyclin-dependent kinase 5 activator 1
Synonyms:
CDK5/p35 Cyclin-dependent kinase 5 regulatory subunit 1 | Cyclin-dependent kinase 5/CDK5 activator 1
Type:
Protein Complex
Mol. Mass.:
Description:
Components:
This complex has 2 components.
Component 1
Name:
Cyclin-dependent kinase 5
Synonyms:
CDK5 CDKN5 Cyclin-dependent kinase 5 (CDK5/ p25) Cyclin-dependent-like kinase 5 PSSALRE Tau protein kinase II catalytic subunit
Type:
Enzyme Subunit
Mol. Mass.:
33308.61
Organism:
Homo sapiens (Human)
Description:
Residue:
292
  
Component 2
Name:
Cyclin-dependent kinase 5 activator 1
Synonyms:
CD5R1_HUMAN CDK5R1 Cyclin-dependent kinase 5 (CDK5/p25) NCK5A p35
Type:
Enzyme Subunit
Mol. Mass.:
34077.43
Organism:
Homo sapiens (Human)
Description:
Q15078
Residue:
307
  
Inhibitor
Name:
BDBM472674
Synonyms:
10,10-dimethyl-2-((5-(4- methylpiperazin-1-yl)pyridin-2- yl)amino)-6,6a,9,10-tetrahydro- 5H-pyrazino[1',2':1,6]pyrido[2,3- d]pyrimidin-7(8H)-one | US10829490, Cmpd # 2
Type:
Small organic molecule
Emp. Form.:
C22H30N8O
Mol. Mass.:
422.5266
SMILES:
CN1CCN(CC1)c1ccc(Nc2ncc3CCC4N(c3n2)C(C)(C)CNC4=O)nc1
: