Target
Cyclin-dependent kinase 6/G1/S-specific cyclin-D1 [L188C]
Ligand
BDBM472680
Substrate
Meas. Tech.
Inhibition In Vitro Assay
IC50
50400±n/a nM
Citation
 Strum, JCJung, D Substituted dihydropyrazino[1 ′,2′:1,5]pyrrolo[2,3-d]pyrimidine-based antiproliferative agents US Patent  US10829490 Publication Date 11/10/2020 
Target
Name:
Cyclin-dependent kinase 6/G1/S-specific cyclin-D1 [L188C]
Synonyms:
CDK6/Cyclin D | Cyclin-Dependent Kinase 6 (CDK6)
Type:
Protein Complex
Mol. Mass.:
Description:
Components:
This complex has 2 components.
Component 1
Name:
Cyclin-dependent kinase 6
Synonyms:
CDK6 CDKN6 Cyclin-dependent kinase 6 (CDK 6) | Serine/threonine-protein kinase PLSTIRE
Type:
Enzyme Subunit
Mol. Mass.:
36937.42
Organism:
Homo sapiens (Human)
Description:
Q00534
Residue:
326
  
Component 2
Name:
G1/S-specific cyclin-D1 [L188C]
Synonyms:
BCL1 CCND1_HUMAN PRAD1
Type:
Enzyme Subunit
Mol. Mass.:
33634.57
Organism:
Homo sapiens (Human)
Description:
P24385[L188C]
Residue:
295
  
Inhibitor
Name:
BDBM472680
Synonyms:
2-((5-(4-methylpiperazin-1- yl)pyridin-2-yl)amino)-6,6a,9,10- tetrahydro-5H- pyrazino[1',2':1,6]pyrido[2,3- d]pyrimidine-5,7(8H)-dione | US10829490, Cmpd # 6
Type:
Small organic molecule
Emp. Form.:
C20H24N8O2
Mol. Mass.:
408.457
SMILES:
CN1CCN(CC1)c1ccc(Nc2ncc3C(=O)CC4N(CCNC4=O)c3n2)nc1
: