Target
Cyclin-T1/Cyclin-dependent kinase 9
Ligand
BDBM472673
Substrate
Meas. Tech.
Inhibition In Vitro Assay
IC50
>100000±n/a nM
Citation
 Strum, JCJung, D Substituted dihydropyrazino[1 ′,2′:1,5]pyrrolo[2,3-d]pyrimidine-based antiproliferative agents US Patent  US10829490 Publication Date 11/10/2020 
Target
Name:
Cyclin-T1/Cyclin-dependent kinase 9
Synonyms:
CDK9/ Cyclin-T1 CDK9/Cyclin T Cyclin T1/dependent kinase 9 | Cyclin-Dependent Kinase 9 (CDK9)
Type:
Protein Complex
Mol. Mass.:
Description:
Components:
This complex has 2 components.
Component 1
Name:
Cyclin-T1
Synonyms:
CCNT1 CycT Cyclin T Cyclin-T
Type:
Enzyme Subunit
Mol. Mass.:
80712.40
Organism:
Homo sapiens (Human)
Description:
Residue:
726
  
Component 2
Name:
Cyclin-dependent kinase 9
Synonyms:
C-2K CDK9 Cell division cycle 2-like protein kinase 4 Cyclin-Dependent Kinase 9 (CDK9) Serine/threonine-protein kinase PITALRE Tat-associated kinase complex catalytic subunit
Type:
Enzyme Subunit
Mol. Mass.:
42789.13
Organism:
Homo sapiens (Human)
Description:
Residue:
372
  
Inhibitor
Name:
BDBM472673
Synonyms:
10,10-dimethyl-2-((5-(4- methylpiperazin-1-yl)pyridin-2- yl)amino)-6,6a,9,10-tetrahydro- 5H-pyrazino[1',2':1,6]pyrido[2,3- d]pyrimidine-5,7(8H)-dione | US10829490, Cmpd # 1
Type:
Small organic molecule
Emp. Form.:
C22H28N8O2
Mol. Mass.:
436.5101
SMILES:
CN1CCN(CC1)c1ccc(Nc2ncc3C(=O)CC4N(c3n2)C(C)(C)CNC4=O)nc1
: