Target
Tyrosine-protein kinase BTK
Ligand
BDBM472727
Substrate
Meas. Tech.
Inhibitory Activity Assay
IC50
110±n/a nM
Citation
 Zhang, ADing, JXie, HSong, ZXue, YTong, LGeng, M Pyrimido[5,4-B]indolizine or pyrimido[5,4-B]pyrrolizine compound, preparation method and use thereof US Patent  US10829491 Publication Date 11/10/2020 
Target
Name:
Tyrosine-protein kinase BTK
Synonyms:
AGMX1 Agammaglobulinaemia tyrosine kinase B cell progenitor kinase BPK BTK_HUMAN Tyrosine Kinase BTK Tyrosine-protein kinase BTK (BTK)
Type:
Enzyme
Mol. Mass.:
76289.95
Organism:
Homo sapiens (Human)
Description:
Q06187
Residue:
659
  
Inhibitor
Name:
BDBM472727
Synonyms:
US10829491, Compound S20
Type:
Small organic molecule
Emp. Form.:
C25H21N7O2
Mol. Mass.:
451.4799
SMILES:
Nc1ncnc2n3C[C@H](NC(=O)C=C)C(=C)c3c(-c3ccc(cc3)C(=O)Nc3ccccn3)c12
: